‘Rees-Mogg said you failed to understand the situation’ Stamp Carney Flame broiled on negative…

00Fast News, Latest News, Breaking News, Today News, Live News. Please Subscribe! ‘Rees-Mogg said you failed to understand the situation’ Stamp Carney Flame broiled on negative Brexit figures BANK OF Britain Representative Check…

Continue reading “‘Rees-Mogg said you failed to understand the situation’ Stamp Carney Flame broiled on negative…”

It's only fair to share...Tweet about this on TwitterShare on FacebookShare on TumblrShare on Google+Digg thisShare on LinkedInPin on PinterestShare on VKShare on RedditPrint this pageEmail this to someone
Flattr the authorShare on StumbleUponShare on YummlyBuffer this page

‘Hammond failed to understand the situation’: Ex-May associate dispatches assault on Chancellor…

00Fast News, Latest News, Breaking News, Today News, Live News. Please Subscribe! ‘Hammond failed to understand the situation’: Ex-May associate dispatches assault on Chancellor days in front of Spending plan THERESA May’s previous…

Continue reading “‘Hammond failed to understand the situation’: Ex-May associate dispatches assault on Chancellor…”

It's only fair to share...Tweet about this on TwitterShare on FacebookShare on TumblrShare on Google+Digg thisShare on LinkedInPin on PinterestShare on VKShare on RedditPrint this pageEmail this to someone
Flattr the authorShare on StumbleUponShare on YummlyBuffer this page

‘German vote shows federalism has FAILED’ Vanis Varoufakis says four years of EU collapse

00Fast News, Latest News, Breaking News, Today News, Live News. Please Subscribe! ‘German vote shows federalism has FAILED’ Vanis Varoufakis says four years of EU collapse FORMER Greek finance minister Yanis Varoufakis has…

Continue reading “‘German vote shows federalism has FAILED’ Vanis Varoufakis says four years of EU collapse”

It's only fair to share...Tweet about this on TwitterShare on FacebookShare on TumblrShare on Google+Digg thisShare on LinkedInPin on PinterestShare on VKShare on RedditPrint this pageEmail this to someone
Flattr the authorShare on StumbleUponShare on YummlyBuffer this page

Breaking News – North Korea Launch Failed Again, Last Test Failed On 3/22/2017

Breaking News – N. Korea Launch Failed Again, Last Test Failed On 3/22/2017 The US official said it had detected a test launch, but it blew up immediately.

Continue reading “Breaking News – North Korea Launch Failed Again, Last Test Failed On 3/22/2017”

It's only fair to share...Tweet about this on TwitterShare on FacebookShare on TumblrShare on Google+Digg thisShare on LinkedInPin on PinterestShare on VKShare on RedditPrint this pageEmail this to someone
Flattr the authorShare on StumbleUponShare on YummlyBuffer this page